{"text_format":"1","workbook":"xlsx","n_sheets":10,"sheets":["Instructions","Background","Special Fuels","Heat supplied (EC1)","Energy Centre(s) (EC1)","Summary (EC1)","Overall Summary","PCDB Data Summary","Format History","Lookups"],"not_rendered":{"charts":2,"images":1,"macros":1,"external_links":0,"defined_names":16,"comments":0,"pivot_tables":0},"unopened":[],"bounds":{"document_bytes":16777216,"sheet_cells":100000,"rows_first":2000,"rows_last":500,"rows_between":2000,"halvings":0,"cell_chars":16384,"cell_head_chars":4096},"cells_cut":0,"cells_raw":0,"read":"whole","date_system":"1900"}

{"sheet":"Instructions","index":0,"n_rows":29,"n_cols":1,"rows_kept":29,"cut":false,"hidden":false,"merged":[]}
["Application workbook for entry of heat network performance data in SAP PCDB"]
[]
["INSTRUCTIONS"]
[]
["1) This workbook should only be completed after reading the latest version of the document: \"Application guide for entry of heat network performance data in SAP Product Characteristics Database\". This can be found at the website: www.ncm-pcdb.org.uk/sap"]
[]
["2) Network Operators must ensure that the latest Workbook Format is completed for applications. This can be checked by visiting the website: www.ncm-pcdb.org.uk/sap "]
[]
["3) Network Operators should fully complete the Workbook and submit to: sapproductlisting@bre.co.uk"]
[]
["4) The PCDB Administrator (Building Research Establishment Ltd) will review the application workbook and report issues (errors or matters requiring clarification) to the Network Operator (applicant) for amendment. "]
[]
["5) Application iterations may result from (4), the Network Operator must ensure that the date the Workbook is completed and submitted or resubmitted is recorded during this process (within Cell B4 of \"Background\" worksheet). This ensures older workbook versions can be distinguished."]
[]
["6) Workbooks submitted by the Network Operator must include the \"Network Name\" and date that the Workbook is submitted or resubmitted in the filename, e.g. \"Application Workbook for listing of heat networks in SAP PCDB - Lerwick District Heating - 13.10.14.xls\""]
{"$rows_left_out":15}
{"sheet":"Background","index":1,"n_rows":107,"n_cols":3,"rows_kept":107,"cut":false,"hidden":false,"merged":[]}
[]
["BACKGROUND"]
[]
["Date workbook completed [DD/MM/YY]"]
[]
["Previous Network Index number (if PCDB listed)"]
[]
["Previous version number (if PCDB listed)"]
[]
["Network Name"]
[]
["Address of the Primary Energy Centre"]
[]
["Postcode of the Primary Energy Centre"]
[]
{"$rows_left_out":93}
{"sheet":"Special Fuels","index":2,"n_rows":103,"n_cols":5,"rows_kept":103,"cut":false,"hidden":false,"merged":[]}
[{"$f":"Instructions!A29","v":"Workbook Format 2.00.9 - 18.7.22"}]
["Note: Only enter data in cells with a yellow background. "]
[]
["If hydrogen is used in the scheme factor please provide:"]
["Hydrogen CO2e Emissions factor",null,null,"CO2e kg/kWh"]
["Hydrogen PE Factor",null,null,"kWh/kWh"]
["If Green Gas Certificates are used in this scheme please provide:"]
["Green Gas CO2e Emissions factor",null,null,"CO2e kg/kWh","(this factor should be representative of the mix of fuel burnt)"]
["Green Gas PE Factor",null,null,"kWh/kWh"]
["If a fuel is proposed to used that doesn't appear above or in the dropdown please enter factors here"]
["Bespoke fuel CO2e Emissions factor",null,null,"CO2e kg/kWh"]
["Bespoke fuel PE Factor",null,null,"kWh/kWh"]
["Please provide justification for these values"]
[]
[]
{"$rows_left_out":89}
{"sheet":"Heat supplied (EC1)","index":3,"n_rows":315,"n_cols":79,"rows_kept":315,"cut":false,"hidden":false,"merged":[]}
[{"$f":"Instructions!A29","v":"Workbook Format 2.00.9 - 18.7.22"}]
[]
["Note: Only enter data in cells with a yellow background. Cells with a blue background contain pre-set calculations."]
["Default Secondary DLF for New Connections",null,null,null,null,null,null,null,null,null,null,null,1.18,"Should only be changed from 1.18 if a different default factor has been agreed with BRE "]
["Long term average primary distribution loss factor",null,null,null,null,null,null,null,null,null,null,null,null,"If left blank calculated value will be used"]
["Year to which data relates",null,null,null,null,null,null,null,null,null,null,null,null,"Leave blank if estimated data"]
[]
[null,null,null,null,null,null,null,null,null,null,null,null,null,null,null,null,"Jan (MWh)","Feb (MWh)","Mar (MWh)","Apr (MWh)","May (MWh)","Jun (MWh)","Jul (MWh)","Aug (MWh)","Sep (MWh)","Oct (MWh)","Nov (MWh)","Dec (MWh)",null,"TOTAL"]
["TOTAL heat supplied to customers",null,null,null,null,null,null,null,null,null,null,null,null,null,"TOTAL heat supplied to customers",null,{"$f":"Q14+Q136","v":0},0,0,0,0,0,0,0,0,0,0,0,null,{"$f":"AD14+AD136","v":0}]
["TOTAL heat supplied to buildings (inc Secondary Losses)",null,null,null,null,null,null,null,null,null,null,null,null,null,"TOTAL heat supplied to buildings (inc Secondary Losses)",null,{"$f":"Q9+AW14","v":0},0,0,0,0,0,0,0,0,0,0,0,null,{"$f":"AD9+BJ14","v":0}]
[null,null,null,null,null,null,null,null,null,null,null,null,null,null,null,null,null,null,null,null,null,null,null,null,null,null,null,null,null,null,null,null,null,null,null,"Profiling if annual values entered"]
["Domestic heat supplied",null,null,null,null,null,null,null,null,null,null,null,null,null,null,null,null,null,null,null,null,null,null,null,null,null,null,null,null,null,null,null,null,null,null,"Profile"]
[null,null,null,null,null,null,null,null,null,null,null,null,null,null,null,null,null,null,null,null,null,null,null,null,null,null,null,null,null,null,null,null,null,null,"Total",{"$f":"SUM(AJ14:AJ15)","v":0.15373142001581275},{"$f":"SUM(AK14:AK15)","v":0.12527498507608562},0.11573887382593304,9.5060978937977408E-2,3.8091306227908073E-2,3.3312190059622902E-2,3.2764850959493129E-2,3.5035853856685499E-2,3.6376030769544786E-2,7.0213055707764566E-2,0.12303914965750976,0.14136130490566237,null,"Secondary Losses",null,null,null,null,null,null,null,null,null,null,null,null,null,null,"Secondary DLFs"]
["TOTAL dwellings",{"$f":"B127+B129+B130+B131+B132","v":0},null,null,null,null,null,null,null,null,null,null,null,null,"Domestic Exc Secondary Losses",null,{"$f":"Q127+Q129+Q130+Q131+Q132","v":0},{"$f":"R127+R129+R130+R131+R132","v":0},0,0,0,0,0,0,0,0,0,0,null,{"$f":"AD127+AD129+AD130+AD131+AD132","v":0},null,null,null,null,"SH",0.10129032258064516,7.9838709677419351E-2,6.8548387096774188E-2,5.4677419354838712E-2,0,0,0,0,0,2.8548387096774194E-2,7.7580645161290318E-2,8.9516129032258071E-2,null,{"$f":"AW127","v":0},{"$f":"AX127","v":0},0,0,0,0,0,0,0,0,0,0,null,0]
[null,null,null,null,null,null,null,null,null,null,null,null,null,null,"Domestic Inc Secondary Losses",null,{"$f":"Q14+AW14","v":0},0,0,0,0,0,0,0,0,0,0,0,null,{"$f":"AD14+BJ14","v":0},null,null,null,null,"DHW",5.2441097435167575E-2,4.5436275398666272E-2,4.7190486729158855E-2,4.0383559583138703E-2,3.8091306227908073E-2,3.3312190059622902E-2,3.2764850959493129E-2,3.5035853856685499E-2,3.6376030769544786E-2,4.1664668610990371E-2,4.5458504496219437E-2,5.1845175873404307E-2]
{"$rows_left_out":301}
{"sheet":"Energy Centre(s) (EC1)","index":4,"n_rows":379,"n_cols":19,"rows_kept":379,"cut":false,"hidden":false,"merged":[]}
[{"$f":"Instructions!A29","v":"Workbook Format 2.00.9 - 18.7.22"},null,null,2,3,4,5,6,7,8,9,10,11,12,13]
["Note: Only enter data in cells with a yellow background. Cells with a blue background contain pre-set calculations."]
["Heat generator type","Number of",null,null,"Long term factors (f left blank, calculated values will be used)"]
["CHP",0,null,null,"Long-term average emissions factor",null,null,null,null,null,"kg CO2 per kWh of heat supplied to Network (ie before any distribution losses)"]
["Heat Pump",0,null,null,"Long-term average primary energy factor",null,null,null,null,null,"kWh of Primary Energy per kWh of heat supplied to Network (ie before any distribution losses)"]
["Heat Recovered without Heat Pump",0,null,null,"Weighted Average Heat Price from EC",null,null,null,null,null,"p/kWh"]
["Boiler Plant",0,null,null,"Pump electricity factor",null,null,null,null,null,"kWh of puming electricity per kWh of heat supplied to buildings (ie before secondary losses)"]
[null,null,null,null,"NB if the long term factors are used above then the long term primary distribution loss factor on the Heat supplied tab must be also be entered"]
["Note: up to 5 of each type of heat generators are allowed. If more than 5 are present then combine into single cells as appropriate."]
[]
["Year to which data relates",null,null,{"$f":"'Heat supplied (EC1)'!M6","v":0}]
[]
["Primary Distribution loss factor",null,null,{"$f":"D16/'Heat supplied (EC1)'!Q10","v":{"$error":"#DIV/0!"}},{"$f":"E16/'Heat supplied (EC1)'!R10","v":{"$error":"#DIV/0!"}},{"$f":"F16/'Heat supplied (EC1)'!S10","v":{"$error":"#DIV/0!"}},{"$f":"G16/'Heat supplied (EC1)'!T10","v":{"$error":"#DIV/0!"}},{"$f":"H16/'Heat supplied (EC1)'!U10","v":{"$error":"#DIV/0!"}},{"$f":"I16/'Heat supplied (EC1)'!V10","v":{"$error":"#DIV/0!"}},{"$f":"J16/'Heat supplied (EC1)'!W10","v":{"$error":"#DIV/0!"}},{"$f":"K16/'Heat supplied (EC1)'!X10","v":{"$error":"#DIV/0!"}},{"$f":"L16/'Heat supplied (EC1)'!Y10","v":{"$error":"#DIV/0!"}},{"$f":"M16/'Heat supplied (EC1)'!Z10","v":{"$error":"#DIV/0!"}},{"$f":"N16/'Heat supplied (EC1)'!AA10","v":{"$error":"#DIV/0!"}},{"$f":"O16/'Heat supplied (EC1)'!AB10","v":{"$error":"#DIV/0!"}},null,{"$f":"Q16/'Heat supplied (EC1)'!AD10","v":{"$error":"#DIV/0!"}}]
[]
[null,null,null,"Jan (MWh)","Feb (MWh)","Mar (MWh)","Apr (MWh)","May (MWh)","Jun (MWh)","Jul (MWh)","Aug (MWh)","Sep (MWh)","Oct (MWh)","Nov (MWh)","Dec (MWh)",null,"TOTAL"]
{"$rows_left_out":365}
{"sheet":"Summary (EC1)","index":5,"n_rows":146,"n_cols":9,"rows_kept":146,"cut":false,"hidden":false,"merged":[]}
[]
["Year to which the data relates",{"$f":"'Heat supplied (EC1)'!M6","v":0}]
[]
["Total heat supplied to customers",{"$f":"'Heat supplied (EC1)'!AD9","v":0},null,"MWh/yr"]
[]
["Total heat supplied to buildings (inc secondary losses)",{"$f":"'Heat supplied (EC1)'!AD10","v":0}]
[]
["Total heat supplied to network",{"$f":"'Energy Centre(s) (EC1)'!Q16","v":0},null,"MWh/yr"]
[]
["Primary distribution loss factor",{"$f":"B8/B6","v":{"$error":"#DIV/0!"}},null,null,{"$f":"IF(B10<1,\"Distribution loss factor is incorrect\",\"greater than 1 check\")","v":{"$error":"#DIV/0!"}}]
[]
["Long term average primary distribution loss factor",{"$f":"IF(ISBLANK('Heat supplied (EC1)'!M5),\"\",'Heat supplied (EC1)'!M5)","v":""},null,null,{"$f":"IF(B12<1,\"Distribution loss factor is incorrect\",\"greater than 1 check\")","v":"greater than 1 check"}]
[]
["Total electrical energy for pumping",{"$f":"'Energy Centre(s) (EC1)'!Q302","v":0},null,"MWh/yr",{"$f":"(B14/B4)*100","v":{"$error":"#DIV/0!"}},"% of heat delivered to customers (zero if long term value used)"]
[]
{"$rows_left_out":132}
{"sheet":"Overall Summary","index":6,"n_rows":136,"n_cols":2,"rows_kept":136,"cut":false,"hidden":false,"merged":[]}
[]
[null,"EC1"]
["Year to which the data relates",{"$f":"'Summary (EC1)'!B2","v":0}]
[]
["Total heat supplied to customers",{"$f":"'Summary (EC1)'!B4","v":0}]
[]
["Total heat supplied to buildings (inc secondary losses)",{"$f":"'Summary (EC1)'!B6","v":0}]
[]
["Total heat supplied to network",{"$f":"'Summary (EC1)'!B8","v":0}]
[]
["Primary Distribution loss factor",{"$f":"B9/B7","v":{"$error":"#DIV/0!"}}]
[]
["Long term average primary distribution loss factor",{"$f":"IF(ISBLANK('Summary (EC1)'!B12),\"\",'Summary (EC1)'!B12)","v":""}]
[]
["Electrical energy for pumping",{"$f":"'Summary (EC1)'!B14","v":0}]
{"$rows_left_out":122}
{"sheet":"PCDB Data Summary","index":7,"n_rows":22,"n_cols":5,"rows_kept":22,"cut":false,"hidden":false,"merged":[]}
["For PCDB Administrator use only"]
[]
[]
[1,null,"Community heat network index number(digits)",null,"Unique index number for each network, assigned automatically by database software and used for control and reference purposes (See Section 4.2)."]
[2,"X","Community heat network version number (2 digits)",null,"Network version for the network identified in field 5. It is numbered from 1 upwards and incremented if the network is extended and when equipment data is amended (for example a change to a heat generator) or if the energy use information is updated."]
[3,"X","Status (one digit)",null,"Status of the data record, encoded as 0=normal status for an actual product, 1=illustrative (non-existent) product, 2=under investigation, 3=not valid, 4=methodology under review (See Section 5)."]
[4,null,"DB entry updated(yyyy/mmm/dd hh:mm)",null,"Date and time this record was created or last amended by the database administrator."]
[5,"X","Community heat network name(up to 50 chs.)",{"$f":"IF(ISBLANK(Background!B10),\"\",Background!B10)","v":""},"The name by which the community heat network is known."]
[6,null,"Description of network (up to 255 chs)",{"$f":"IF(ISBLANK(Background!B24),\"\",Background!B24)","v":""},"A short description identifying the dwellings to which the network version applies. Where the network is constructed in phases this may also indicate which phases are connected."]
[7,"X","Validity end date (yyyy/mmm/dd)",null,"The last day of validity of this data record. Dwellings assessed after this date use a data record with a higher network version number (in the case of new dwellings the applicable assessment date is that of the as-designed assessment). Blank if there is no record with a higher network version number."]
[8,null,"Postcode of the Primary Energy Centre (up to 8 chs)",{"$f":"IF(ISBLANK(Background!B14),\"\",Background!B14)","v":""},"The postcode of the energy centre providing heat for the network. Where there is more than one energy centre, it is the postcode for the energy centre supplying the largest amount of heat"]
[9,"X","Service provision (1 digit)",null,"Service provision, encoded as: 1 space and water heating; 3 space heating only; 4 water heating only. If a network has separate systems for space heating and water heating, there will be a record for each."]
[10,null,"Data source (1 digit)",null,"Whether the record represents provisional (estimated) data, actual recorded data or forecast data, encoded as 1,2 and 3 respectively. Provisional data may be assigned to new networks for which recorded data are not yet available."]
[11,null,"Year (up to 4 digits)",null,"The calendar year to which the data relates. Blank if provisional data."]
[12,null,"Number of sub-heat networks",1,"The total number of sub-heat networks included in the assessment of this heat network."]
{"$rows_left_out":8}
{"sheet":"Format History","index":8,"n_rows":18,"n_cols":3,"rows_kept":18,"cut":false,"hidden":false,"merged":[]}
["FORMAT NUMBER","DATE","NOTES"]
[]
[1.2,"28.10.14","Draft 1"]
[1.3,"05.07.21","CD changes adding monthly CO2 and PE"]
[1.4,"06.09.21","CD changes to allow more heat generators"]
[1.5,"02.12.21","CD changes to allow multiple energy centres, adding weighted heat cost, block level DLF, long term PLF"]
[1.6,"13.12.21","CD changes to allow bespoke fuel"]
[1.7,"14.12.21","CD change to reflect high grade/low grade heat replacing industrial/commercial heat and added commissioning date"]
[1.8,"15.12.21","CD change to remove geothermal from lookup which was duplicated. Adjusted factors to match Table 12"]
[1.9,"23.2.22","CD changes to reflect consultation responses"]
[1.91,"8.3.22","CD changes to carbon factor lookups to match corrected 10.2 spec (Heat recovered from categories)"]
["1.99.7","10.5.22","CD changes to EC1 results formatting, adding data summary sheet and new pumping energy calc"]
["1.99.8","13.5.22","Corrections to biomass, biogas and December electricity PE factor lookups. CHP New date changed from 1/6/22 to 15/6/22."]
["1.99.9","17.5.22","Corrections to Emission & PE lookups on Energy Centre Sheet"]
["2.00.0","22.5.22","Long-term average plant mix added"]
{"$rows_left_out":4}
{"sheet":"Lookups","index":9,"n_rows":100,"n_cols":16,"rows_kept":100,"cut":false,"hidden":true,"merged":[]}
[null,"CHP New date","2022-06-15"]
[null,"CHP Existing Old date","2015-01-01"]
[]
[null,"CHP type"]
[null,"Export Only"]
[null,"Flexible Operation"]
[null,"Standard"]
[]
[null,"Heat Generation Types"]
[null,"Boilers"]
[null,"Heat pump"]
[null,"Heat recovered without heat pump"]
[]
[]
[]
{"$rows_left_out":85}